Home > Parse Error > Parse Error Syntax Error Unexpected ' ' In /bin/sh On Line 90 You Use Fresh Version

Parse Error Syntax Error Unexpected ' ' In /bin/sh On Line 90 You Use Fresh Version

The proper solution, of course, is to fix the scripts, which are buggy by definition. yes checking for getcwd... Jail root-user can mount jail-friendly filesystems: devfs, procfs, nullfs, zfs datasets.7. Script input read var1 var2 rest read a line from stdin, parsing by $IFS, and placing the words into the named variables. his comment is here

I am also getting Syntax error: "(" unexpected The problem is, I was NOT getting it an hour ago! Standard output from the first command (inner subshell) is passed into the pipeline as normal, but the final output of the pipeline is redirected to 3 so that it appears on same damn error. Solution: Please see the mailing-list FAQ.

Problem: I get segmentation fault while trying to simulate using DSR in dbugged version of ns-2.1b9 (ns-dbug-dsr-072202.tar.gz). On my system, I removed the /bin/sh link to dash, and changed it to point to /bin/bash. I pushed my ~/local to have higher precedence in the path and the npm installation worked without a hitch.

share|improve this answer edited Mar 15 at 10:21 fschmengler 32.8k1266192 answered Mar 15 at 9:49 De Nguyen 464 add a comment| Your Answer draft saved draft discarded Sign up or cazzoo commented May 23, 2015 Yet the first script does not work on all distribs. The variable always has length n if specified. -R[n] Right justify and fill with leading blanks. Because of this, the script must be readable as well as executable.

Floyd. mkdir ~/.nave cd ~/.nave wget sudo ln -s $PWD/ /usr/local/bin/nave # now you can forget about that folder. # you never have to go back in there. # to use And it ran over a minute and did bunch of stuff. The self-compiled node version created with the first script works perfectly :) JeanNiBee commented Dec 5, 2010 First option worked well for me once I realize that the path of node

Also, the description should be updated - with being replaced by which has also changed. good work! It installs all correctly but the npm command doesn't work, it does nothing. ptica commented Aug 15, 2014 re: curl | sh resulted in curl: (51) SSL: certificate subject name '' does not match target host name '' seems that npm is

chadams commented Jan 7, 2011 If your on a MAC remember your ".bashrc" isn't used, it should be ".bash_profile" maxidr commented Jan 29, 2011 Thanks for share!! It's most probably missing fi or } somewhere, but without indentation you won't ever see where. –Jan Hudec Mar 27 '12 at 9:17 What is the assignment to value Sometimes used as a synonym for "true" in a loop. Note that since DSR now uses CMUPriQueue, all dsr scripts previously using "Queue/DropTail/PriQueue" should be replaced with "CMUPriQueue".

characters tell the system to locate the following pathname, start it up and feed it the rest of the file as input. this content After you've got all these tools, apply the following patch to ~ns/tcl/test/test-all-template1 to get around the \r\n problem: *** test-all-template1.orig Wed Jan 5 01:01:00 2000 --- test-all-template1 Thu Jun 22 16:04:10 I'm using service, default is PHP 5.2 and I have switched to PHP 5.6 in CPANEL. Whenever your RAM is too low, this problem might also happen.

  • You can change this in a script to make sure you get the programs you intend, and don't accidentally get other versions which might have been installed. $TERM The terminal type
  • Problem: Validation fails with the on test-all-aimd with the following messages: ./test-all-aimd QUIET Tests: tcp tcpA tcpB tcp_tahoe tcpA_tahoe tcp_reno tcpA_reno tcp_newreno tcpA_newreno ../../ns test-suite-aimd.tcl tcp QUIET Test output agrees with
  • manojwins commented May 27, 2013 I am getting this error in both method 1 and 2.
  • code EACCES npm ERR!
  • Ex: 'which node' returns a path to my ~/jbateman/local installation instead of /usr/local/bin thynctank commented Dec 13, 2010 seems like someone is keeping ports up to date as well...
  • but dash is much more different.
  • As well, all of the sites I visited said that npm was included with the nodejs module yet the nodejs version existing in the default Ubuntu repository did not seem to
  • Typically they would be placed in a separate file and read with the "." operator.

Afterwards, increase your pagefile up to two times your memory. more hot questions question feed lang-sh about us tour help blog chat data legal privacy policy work here advertising info mobile contact us feedback Technology Life / Arts Culture / Recreation For example, I got messages like: [[email protected] ns-2.27]# patch < newfi.patch patching file Hunk #1 FAILED at 25. 1 out of 1 hunk FAILED -- saving rejects to file Wij zijn een bekende naam op het gebied van duurzaamheid, wij adviseren energieleveranciers en bedrijven in hoe zij groener kunnen zijn.

Gezien de projecten voor hun klanten van de afgelopen jaren zijn ze over het algemeen gericht op het maatschappelijke. Conventionally 0=success and any other value indicates a problem. no checking for gettimeofday declaration...

Compound commands can be thought of as running in an implicit subshell.

These viruses usually just get away with the anti-virus scan. The following information is way outdated. npm ERR! leto commented Aug 29, 2013 ./configure --prefix=/local does not work on my system, it creates a directory called "".

Several possible fixes: Reinstall bash: sudo aptitude reinstall bash Upgrade to Hardy Download the bash source package, bump the version number, build the package, and install it. The real problem is that: a) some people equate sh with bash, and b) bash does a poor job of emulating sh. I do agree with easingthemes and Aedx that @isaacs should update the code with the up-to-date curl. check over here Problem:Everytime you run ns, 2 files and are created.

For example, if you are running one application on the host that requires Perl 5.12, but you want to install another piece of software that only supports up to Perl 5.8 I could get any of @isaacs scripts to work when I first tried (a while back) and had to do: sudo apt-get install -y python-software-properties python g++ make After that, the This example shows the simplest and fastest way. 1: #!/bin/sh 2: 3: # Demonstrate reading a file line-by-line, using I/O 4: # redirection in a compound command 5: # Also test During this process searching for the main cause, you will finally realize that there are quite number of reasons why such error takes place.

Themen & Beiträge Heutige Beiträge Unbeantwortete Themen Suchen Zeige Themen Zeige Beiträge Erweiterte Suche Nützliche Links Mein Profil Marktplatz-Bewertungen Alle Foren als gelesen markieren Forum » Netzwerke und Internet » Heimnetzwerke If the command was terminated by a signal, the value is 128 plus the signal value. (8) Filename Wildcards The following characters are interpreted by the shell as filename wildcards, and Same thing goes if you want to fix Parse Error Syntax Error Unexpected ‘ ‘ In /bin/sh On Line 90 You Use Fresh Version. would make it easier to implement; less testing required!

ksh/bash additional features $SECONDS (readonly) Integer number of seconds since this shell was started. Redirecting for the whole script Redirecting stdout, stderr and other file descriptors for the whole script can be done with the exec command. I just wish Ubuntu would join in with the industry standard way of doing things. Thanks.

at IOWatcher.callback (dns.js:53:15) npm ERR!